单元测试框架Pytest的安装及入门

发表于:2022-5-13 09:04  作者:已撤退   来源:掘金

字体: | 上一篇 | 下一篇 |我要投稿 | 推荐标签: pytest 测试框架

  安装Pytest
  这个安装其实很简单的,首先第一步,查看自己的Python版本,是Python2还是Python3,下面是查看版本的命令。

  大家可以看截图,我是安装了2个版本的Python。
  接下来,我们可以使用pip来安装使用的Pytest包。
pip install pytest

  使用了如上命令之后,我们查看是否安装成功。可以使用pip list,查看Python是否安装了Pytest包。如下:

  还可以使用 python3 -m pytest --version:

  这个时候,Pytest安装成功。

  开发工具
  开发工具小编使用的是vscode,这个工具小巧灵活,配置简单,可以直接去vscode官网直接下载。

  写完的测试用例,可以直接运行。

  创建你的第一个测试用例
  放文件的文件夹使用*Test命名
  用例文件使用*test或者test*
  类名使用Test*Class
  用例方法名使用test_*
  如下:
class TestClass:
    def test_one(self):
        x = "this"
        assert "h" in x
    def test_two(self):
        x = "hello"
        assert hasattr(x,"check")

  上图的参数解释:
  python3 -m pytest test_3.py //运行单个测试用例文件。
  test_3.py .F   [100%]  //运行的文件是test_3.py文件,小绿点是表示用例成功运行,F表示运行失败,100%代表用例全部执行。
  ================FAILURES ================ //下面是运行失败的用例,因为什么没有通过。
  ___________ TestClass.test_two ________ //那条用例失败了。
self = <test_3.TestClass object at 0x10893b9a0>

    def test_two(self):
        x = "hello"
>       assert hasattr(x,"check")
E       AssertionError: assert False
E        +  where False = hasattr('hello', 'check')

test_3.py:7: AssertionError

  //那行失败了。
  =============== 1 failed, 1 passed in 0.09s ======= //成功通过几条,失败几条。运行此文件花费的时长。

  断言
  assert语句来断言你测试用例的期望结果。
  Pytest的高级断言内省机制, 可以智能地展示断言表达式的中间结果, 来避免来源于JUnit的方法中的变量名重复问题。

  执行多条测试用例
  Pytest命令会执行当前目录及子目录下所有test_*.py及*_test.py格式的文件,一般来说,用例需要遵循标准的测试发现规则。

  本文内容不用于商业目的,如涉及知识产权问题,请权利人联系51Testing小编(021-64471599-8017),我们将立即处理

评 论

论坛新帖



建议使用IE 6.0以上浏览器,800×600以上分辨率,法律顾问:上海漕溪律师事务所 项棋律师
版权所有 上海博为峰软件技术股份有限公司 Copyright©51testing.com 2003-2022, 沪ICP备05003035号
投诉及意见反馈:webmaster@51testing.com; 业务联系:service@51testing.com 021-64471599-8017

沪公网安备 31010102002173号

51Testing官方微信

51Testing官方微博

扫一扫 测试知识全知道